Openqa selenium webdriverexception unknown error failed to create a chrome process


Openqa selenium webdriverexception unknown error failed to create a chrome process

m2/repository Recent in selenium. This is interfering with a Google Optimize test I'm running because the test is redirecting traffic from my main page to two variant pages and causing the alert to appear as soon as the person hits the page. Before jumping on the main topic of “Exception Handling in Selenium Automation Framework“, it is better to have basic understanding of Error, Exception, Exception Handling, Try, Catch, Throw and Throws statement. ChromeOptions class. I am facing this exception when I run a Selenium test case using the Firefox driver on the AWS EC2 instance which is the headless server. 18 Java Examples for org. This article explains how we can use WebDriver Playback feature and run our Selenium IDE script in different browsers other than Mozilla Firefox. In machine B register node with parameter -Dwebdriver. C:\Users\Admin\Downloads>java -jar selenium-server-standalone-2. Because of the very limited time/resources we have, it is much appreciated if minimal test cases are provided, so the developers focus on fixing the issues, not also discovering the root cause. As you can see to work with Firefox we have to set the property now. Hi Nikolay, I am loving the course! I have encountered some strange issues in Visual Studio. openqa. WebDriverException: unknown error: call function result missing 'value' Key Components of HBase Why visual studio 2015 can not open blockchain api project on github [selenium-developer-activity] Re: Issue 3000 in selenium: Getting org. common. When I open the webpage on the VM with Chr unknown error: cannot create temp dir for unpacking extensions After some googling and testing, I've found this is because when starting the ChromeDriver, it tries to create a temporary folder for unpacking extensions in the user temp directory, which fails because the LOCAL_SYSTEM account doesn't have a user directory. Selenium. selenium. 此文主要讲述 Java 运行 Selenium 脚本时,因 Friefox 浏览器版本与 selenium-server-standalone-x. Cross Browser Testing : Is to check that your web application works as expected in different browsers. 17---2. 12---2. WebDriverException: unknown error: Element Krishnan Mahadevan What happens when you move the instantiation of driver into the test method instead of having it outside? Since you ended up referring to the same driver object in all the test methods am guessing parallelism is messing up things for you becausr all the three test methods would now try to access the same driver object concurrently. eg. Your job or account has been banned for abusing the Sauce Labs service. chrome. WebDriverException. All stack traces matching org. gecko. These examples are extracted from open source projects. Teams. 2 to a co-workers laptop, when trying to run the test, test fails with this exception Test FAILED because (of) (Stack trace: com. objectContaining like I might when matching manually. This section describes how to run a Selenium Integration test case on Google Chrome on your local computer. 9. So, when you call PageFactory. forum. Support and Selenium. We will try to run a Selenium IDE test script on Google Chrome browser. html . 1 --port 4723 --platform-name Android --platform-version 23 --automation-name Appium --log-no-color warn: Appium support for versions of node < 0. WebDriverException: Failed to connect to binary FirefoxBinary 报错解决方法。 希望能对初学 Selenium2 WebUI 自动化测试编程的亲们有所帮助。 I have code which rewrites a context-free grammar into Chomsky Normal Form. com Blogger 54 1 25 tag:blogger Push the code and as expected, various tests were failing. WebDriverException: Message: unknown error: Chrome failed to start: exited normally (The process started from chrome location /usr/bin/google-chrome is no longer running, so ChromeDriver is assuming that Chrome has . Our setup is a Windows 2003 Server with a Selenium hub and one Selenium node running on the same machine. Wouldn’t it be useful to have a list where you could look to find out what they mean and how to fix them? Here you go! Below is a The reason for this release is to upgrade the Chrome Driver from version 2. Can anybody help me to resolve the  19 Nov 2018 handleStartService() Error starting service: org. WebDriverException: unknown error: Chrome failed to start: exited abnormally 0 ChromeDriver crashes and does not create a session when chrome is already open in selenium-jvm After installing Katalon Studio v. 15---2. So in machine A Run hub java -jar lib/selenium-server-standalone-2. lang. 7, 3. Selenium Webdriver by default support firefox browser only that is the reason we did not face any issue while working with Firefox. My Chrome browser got updated to 57 and I have webdriver version 2. readthedocs. Hi. driver. GitHub is home to over 36 million developers working together to host and review code, manage projects, and build software together. 632Z ERROR [OsProcess] org. org. WebDriverException: unknown error: Chrome failed to start: exited abnormally (The process started from chrome location /usr/bin/google-chrome is no longer  9 May 2018 WebDriverException: unknown error: call function result missing 'value' Exception in thread "main" org. WebDriverException: Error communicating with the remote browser. 16299 x86_64) (WARNING: The server did not provide any Recent in Selenium. x. KeywordMain - Unable to open browser with url: ‘’ (Root cause: org. ExecuteException: Process exited with an error: 127 (Exit value: 127) 2019-02-15T11:50:12. WebDriverException occurred in WebDriver. jar -role w HtmlUnit is not able to get an url which is allowed to access only in corporate network. Sauce Labs takes measures to safeguard our price and performance for our paying customers, including termination of accounts we believe are not operating in good faith. Selenium is an umbrella project encapsulating a variety of tools and libraries enabling web browser automation. There you can find a description of the tool and the download lin= k. BirdBrain. Webdriver version 3. WebDriverException: unknown error: Chrome failed to start: exited abnormally Test ll work on chrome node jenkins-openshift. ToXmlString line it drops with a PlatformNo This will be the combination of the any frameworks like Keyword driven+DataDriven or Data driven + modular driven. First i am not sure you need all these options: ChromeOptions options = new ChromeOptions(); options. These source code samples are taken from different open source projects. Using selenium on node. 3325. If you are not interested about those then you can just stop in the middle of this tutorial. 8. However, when I run pg_regress using lldb, the test failed and reported: "failed to wait for subprocesses: Interrupted system call" I customized a test schedule file which only has one test SQL. firefox. Help make the web just work! Identifying a root cause helps us resolve issues more quickly. Ishan Dev Shukl's Blog | Testing beyond limits! Ishan Dev Shukl http://www. Selenium . Lo más fácil es hacer que los nodos de la red registren la ruta binaria de Firefox como parte de la configuración del nodo. 2 jar) with FF 32. Download Process Explorer and unpack it to a local fol= der on your computer. blogger. jar 不兼容引起的 org. ChromeDriver. what is the actual process of manual testing? what is the actual selenium process? i want to know how i apply the types and techniqus in manual testing? i got a reply a person who told me in testing there is a 1000 types and techiques are there in testing ? is it ? i want to org. 267521,platform=Windows NT 6. 18 This video will guide you how to start firefox Browser in Selenium webdriver 3 with GeckoDriver Today we will see how to solve Unable to connect to host 127. And this problem is only coming wh=en i am running my script in centos server of my AWS instance. Re: Issue 2766 in selenium: Chrome - Element is not clickable at point Showing 1-101 of 101 messages Subject: Re: [selenium-users] Programmatically open Selenium Hub and Node - ErrorDefaultRemoteProxy unknown version Hello Krishnan/group, I was trying to setup Jenkins with selenium Grid but on Centos Instances, Unfortunately I was unable to see lot of documentation for the purpose. Users are the drivers to support which version, if 2. 488763 I'm having an issue I've hit a wall on, I'm hoping someone else has encountered. Firefox() print browser. 16 Dec 2018 When I run my program without any chrome processes active, it works. 0. java:178) at org. Selenium specifically provides infrastructure for the W3C WebDriver specification a platform and language-neutral coding interface compatible with all major web browsers. com,输入文字搜索。这个脚本运行正常。 出现这个问题,是因为关毕了appium,或者是关毕了appium再次打开,那么session就不是一样的了所以报错. For one of the app, nwjs is not loading, I found that file size is larger (62 MB). WebDriverException: unknown error: Chrome failed to start: crashed (unknown error: DevToolsActivePort file doesn't exist) (The process started from chrome location C:\Users\rajnish_sai\AppData\Local\Google\Chrome\Application\chrome. You will see Exception Handling in Java selenium webdriver | Selenium Easy Here how to specify which list we have to edit. [13620: 13324:1214/160750. Also with Selenium 2. Fixed the issue in Selenium: An exception of type OpenQA. If you investigate to the failed message of the test execution, it includes the message “org. jar -role hub. This affects all elements that I am trying to click, each of which are clearly visible and away from the sides of the screen. Any video installations to follow? or Screenshots?-Keeya selenium. If the resizing is not critical for your tests, I would suggest you avoid the manage() method altogether and use a workaround of having your browser window always maximized using the ChromeOptions object at the launch of your org. === removed file '. cc(620)] Shader Cache Creation failed: -2 WebDriverException: Message: unknown error: Chrome failed to (The process started from chrome location C:\Program Files . I am trying to use this code to generate a public and private key, I am using . I’m getting this error, please help me! O. 75 and Selenium. 5 and above. 7. Then the next question come to your mind is How to run webdriver in other browsers. Count number of rows in column A that have a value in a list in column B on worksheet 2; google-cloud-sdk - Fatal errors on both update and attempted reinstall Mac OSX 10. How to mention it in excel. Appium uses ‘Appium Inspector’ to view the elements similar to what we have as ‘uiautomatorviewer’ tool to view UI components in Android in UI Automator. 0) to match on an an array of objects that contain a generated field. Selenium Chromedriver launches Chrome 57, but doesn't open website. selenium+python配置chrome浏览器的选项 1. Any suggestions on the process for MAC users. Steps to Create headless Chrome : 1. exceptions. e the exact location from where we would like to download the file . 5 Description. ) I have a Debian-based Google Compute Engine to run my Selenium scripts, but I cannot for the life of me run any scripts interfacing with Chrome. findLookupValues(ScheduleParameter. Is there any way to get it done?Using the Python API, it's pretty simple: from selenium import webdriver browser = webdriver. 31. 8 Eclipse Selenium 2. The window resizing doesn't work with the chromedriver and the community is silent on this bug fix. chrome. And the output (downloaded file) will be stored at C:\Users\Public\Downloads. What is an Exception Running a headless Selenium machine with Google’s Chrome installed provides a scalable way to automate your tests on one of the most popular browsers in use. Code snippet Manual browser setting will remain limited to your computer only means If same software test will be executed on other computer then your test will fail If IE browser's "Enable Protected Mode" settings not configured In that computer. label" as a capability, whose value is an expression of label names to narrow down where to run the tests. To unsubscribe from this group and stop receiving emails from it, send an email to webdriver+unsubscribe@googlegroups. keyword. 1. com Ishan Dev Shukl's Blog | Testing beyond limits! Ishan Dev Shukl http://www. Go to Process Explorer = page. 44. 1 on port 7055 after 45000 ms. driver system property 20 hours ago; Stuck in this issue please help me out 1 day ago It allows users to run Selenium IDE tests in multiple browsers. I am attempting to use Jest's new Property Matcher feature (since Jest 23. Firefox console output: selenium. String: ACCEPT_ALERT "acceptAlert" public static Internet Explorer¶. x is more important, then let it be 2. WebDriverException: unknown error: Chrome failed to start: exited abnormally (unknown error: DevToolsActivePort file doesn’t exist) (The process started from chrome location /usr/bin/google-chrome is no longer running, so ChromeDriver is assuming that Chrome has crashed. chrome . 506120 SP1 x86) (WARNING: The server did not provide any stacktrace information) Command  Selenium::WebDriver::Error::SessionNotCreatedError: session not created and sudo apt update && sudo apt install google-chrome-stable can't install proper This did not work because the command chromedriver-update does not exist. WebDriverException: unknown error: Chrome failed to start: exited abnormally (unknown error: DevToolsActivePort file doesn’t exist) (The process started from chrome location /usr/bin/google-chrome is This tutorial will walk you through basic steps to run Katalon Studio’s web UI tests using our plugin for Jenkins on a headless Ubuntu machine i. AutoIT is a third party tool to handle window based applications. 13---2. xx. 47. jar. You can Disable Developer Mode Extension in Chrome using some additional code. WebDriverException: unknown error: keys should be a string. 821:ERROR:shader_disk_cache. The browser launches the browser and doe not open the url 2019-02-15T11:50:12. we will divide entire project in to modules and write functions or procedures for each and every module and automate the project. To unsubscribe from this group and stop receiving emails from it, send an email to selenium-users+unsubscribe@googlegroups. 14---2. The problem is, now it is not able to put any input in the search inbox textfield, may be you can check the element and see if there is something which is not supported anymore. WebDriverException: Message: unknown error: cannot find Chrome binary 09-21 阅读数 2935 遇到了上面这个问题有两种可能没有chromedriver没有找到chrome对于第一种:用下面的这种方法【解决方案】Selenium打开网站却显示空白对于第二种,可以看下下面的东西。 求助有用过selenium的童鞋们,我在eclipse下运行以下JAVA程序,调用firefox,访问www. I have the Normally to run webdriver, we just need a browser and a selenium server jar file. These source code samples are taken from different open source projects. But selenium fails to handle this as it has support for only web based application. binary. I have downloaded the latest version of ChromeDriver and added the path to the exe to my PATH environment variable. baidu. ★Selenium WebDriver问题无法打开Chrome浏览器☆,Selenium,WebDriver,问题,无法,打开,Chrome,浏览器, selenium. How to automate "edit and update" option through Data driven approach? Thanks for sharing. 0 and Firefox 19. config = I press play to see if it will launch Chrome Browser and get this error: [error] Could not connect to Selenium Server. The current supported Python versions are 2. Q&A for Work. 1---2. This guide will show you how to run a GUI application headless in a Docker container and even more specific scenarios involving running Firefox and Chrome. I have tried putting both a plain object and a matcher definition using expect. Stack Exchange network consists of 175 Q&A communities including Stack Overflow, the largest, most trusted online community for developers to learn, share their knowledge, and build their careers. The following java examples will help you to understand the usage of org. Through Selenium Python API you can access all functionalities of Selenium WebDriver in an intuitive way. This is due to missing the chrome driver path with the node. 28. 1 SP1 x86_64) (WARNING: The server did not provide any stacktrace information) Command duration or timeout: 61. 42. 1 Chrome Driver, and for tests using that driver to silently fail by timing out. exec. commons. 1:4444/wd/hub/static/resource/hub. Hello guys, I've been fighting with this issue for a long time, and just y'day I figure out how to make it gone and today I can run a 50 threads process calling selenium without seen this issue anymore and also stop crashing my machine with outofmemory issue with too many open chromedriver process. I would then go to the Chrome Driver folder folder of Katalon which will be "Katalon_Studio_Windows_64-5. remote. 16---2. The biggest change in Selenium recently has been the inclusion of the WebDriver API. I have the following framework. Have you started the Selenium Server yet? No instructions on how to start the server is provided. k. 745Z ERROR [AnyExceptionClassMapper] Unhandled exception in REST resource org. js. I am able to do that for most of the apps. What I don't understand is what command to execute in CMD so that my script recorded in Firefox will run in IE or Chrome. I made it for my self for ease, looks like complicating myself. S Windows 10 Java 1. Follow these steps: Download the Selenium Chrome driver and save it to a local directory. exe is no longer running, so ChromeDriver is assuming that Chrome has crashed. Some were the tests that often failed for reasons unknown so I introduced some more delays and WaitForDisplayed and what have you, but it wasn't helping, tests were randomnly failing. The path to the driver executable must be set by the webdriver. Selenium support almost all browser now. 3683. exe is no longer running, so ChromeDriver is assuming that Chrome org. 3202. @rong4188: This is a long standing issue with Chromedriver. com/profile/16028985373997485301 noreply@blogger. 1 to 2. Firstly we should add the objects to repository ( Shared selenium. 8 Originally reported on Google Code with ID 3719 When using ChromeDriver via ChromeDriverService and RemoteDriver and run multiple tests. selenium. . ) Hi, we encountered this problem with different Selenium and Firefox versions. 3. Join GitHub today. [DEBUG] Using manager EnhancedLocalRepositoryManager with priority 10 for /Users/duke/. If you investigate the failed message of the test execution, it includes the message “org. NewProfileExtensionConnection and can't create Driver object. 背景. addArguments("--no-sandbox");  27 Jul 2019 I tried to resolve this error and eventually I found out that WebDriver was attempting to run Chrome from  WebDriverException: unknown error: Chrome failed to start: exited abnormally Unable to open browser with url: '' (Root cause: org. to execute Selenium script we need to download some third party drivers and specify the path. When I reached the Select a system image there were some to choose from, and I picked one and it started installing. I've been fighting with this issue for a long time, and just y'day I figure out how to make it gone and today I can run a 50 threads process calling selenium without seen this issue anymore and also stop crashing my machine with outofmemory issue with too many open chromedriver process. so the command should be something like this. Description. This video will guide you how to start firefox Browser in Selenium webdriver 3 with GeckoDriver Today we will see how to solve Unable to connect to host 127. 10---2. WebDriverException: unknown error: Chrome failed to start: crashed (unknown error: DevToolsActivePort file doesn't exist) (The process started from chrome location C:\Program Files (x86)\Google\Chrome\Application\chrome. classpath' --- debian/. I installed Firefox and all the necessary changes for it At Coepd - (Center of Excellence for Professional Development) Manual & Selenium testing training program is designed to give participants the skills & knowledge to gain a competitive advantage in starting/enhancing a career in software testing. I am at a lost of what to do. pid # browser. 24), but without success either and It's not possible to upgrade to selenium driver 3. WebDriverException: unknown error: cannot find Chrome binary” Can you plz help me sir. 11---2. katalon. java file and –> Run As –> Run Confinguration –> In pop up Go Testng –> Right Click on Testng and Click on New –> Give name to your Run Configuration, Browser Class and select your Xml just by Browsing in front of Suit –> hit on Finish and this would run your test While working with Selenium Webdriver using Chrome browser you might get one additional popup. internal. This is because an automatic update made to Chrome in the last week causes Chrome to no longer work with the 2. WebDriverException: unknown error: chrome failed to start I would start with using Task Manager and ensuring all Chrome processes are killed off. WebDriverException: unknown error: Chrome failed to start Output console. 在使用selenium浏览器渲染技术,爬取网站信息时,默认情况下就是一个普通的纯净的chrome浏览器,而我们平时在使用浏览器时,经常就添加一些插件,扩展,代理之类的应用。 JavaScript can be a nightmare to debug: Some errors it gives can be very difficult to understand at first, and the line numbers given aren’t always helpful either. WebDriverException: unknown error: Element is not clickable at point”. 2357. I wish to test this, in particular with property testing. Hi Kaushik, Below given are the logs: Checking if an update is available Update not available Launching Appium server with command: C:\Program Files (x86)\Appium\node. 我想要实现的目标在Ubuntu 14 non gui上成功运行无头镀铬的量角器测试. 5. WebDriver; import org. If we are using Selenium WebDriver, we can automate test cases using Internet Explorer, FireFox, Chrome, Safari browsers. com,输入文字搜索。这个脚本运行正常。 I meet this problem today,and solved it finally. ChromeDriver : Could not instantiate class org . Appreciate all suggestions. @swati_dave wrote:. 0 java client library) and all its dependencies, and will create the project for you, using a maven pom. Selenium RC server launches a browser (or reuses an old one) with a URL that will load Selenium-Core in the web page. To Run Selenium test on Chrome we need chrome driver. Cause. (Driver info: chromedriver=2. 0 Java 7(也尝试使用Java 8)并且还设置了LOCAL_HOME. To post to this group, send email to selenium-developer-activity@googlegroups. WebDriverException: Message: unable to set cookie 最近总算是把爬虫的东西都做完了,简单的功能实现,到最后感觉用selenium就是在模拟用户行为,点这点那,输入这个输入那个,最后碰到个问题,文件点击下载了,怎么能够获取到chrome下载文件的状态,知道他全都下载完了,然后用quit关闭 Name Last modified Size ETag; 2. with outofmemory issue with too many open chromedriver process. ( unknown error: DevToolsActivePort file doesn't exist) (The process  2018年12月17日 selenium. WebDriverException: unknown error: cannot get automat 03-30 阅读数 225 因为工作,我需要学习自动化测试,在使用selenium时出现了bug,废话不多说,先贴报错信息定位错误代码行这句代码是chromedriver使浏览器最大化之所以报错是因为chromedriver Here is the AutoIt Script for downloading a file from website. If that is not possible or you want your test to run with a different configuration or proxy, then you can use the following technique that uses a Capababilities object. init() you initiate a mechanism that is called a Reflection that allows the code analyze itself in runtime. The same code works with Chrome, FF, IE and PhantomJS. selenium . So if 26 weeks out of the last 52 had non-zero commits and the rest had zero commits, the score would be 50%. I still think it’s good idea to improve the logging - not sure if its your fault or Selenium but I get this message only when run the sample code as a console application (when run like a proper nunit test I we are using this godaddy workspace for our application emails and all, and we search email and then fetch something from there. To execute test cases with different browsers in the same machine at same time we can integrate TestNG with Selenium WebDriver. 940 ERROR c. 5 i want to know about the real time project manual testing process. classpath 1970-01-01 00:00:00 +0000 @@ -1,57 +0,0 求助有用过selenium的童鞋们,我在eclipse下运行以下JAVA程序,调用firefox,访问www. NET Core 2 on Windows 10So far I had no success in running this code, it compiles just fine but when I get to the rsa. arrayContaining and expect. Firefox in Selenium using geckodriver. I have Mobile Native app in which one functionality is related to searching location in Google Map. How do I run this code and where do I do that? I have a browser and selenium IDE installed. dll but was not handled in user code I am currently working on a new project where I need to write Selenium with C# to do the web automation in Visual Studio 2015. ・「Chrome failed to start: exited abnormally」ここも原因のひとつかも(?) ・「Driver info: driver. getting java. seleniu 论坛  16 Jul 2018 Sudden, i got requirement to run test in Chrome browser. WebDriverException: Message: unknown error: Chrome failed to start: exited normally (unknown error: Devtools port number file contents <43604> were in an unexpected format) (The process started from chrome location /usr/bin/google-chrome is no longer running, so ChromeDriver is assuming that Chrome has crashed Selenium core is the core js engine of Selenium which executes tests on browser, but because of same origin policy it needs to be deployed on app server itself, which is not always feasible. How to access variables in s string interpolation in Scala? 22 seconds ago create and sign a CA key and certificate using openssl 5 minutes ago; How to set desired capabilities in Python Selenium Webdriver? 9 minutes ago On my site right now, I have an alert that appears before the user leaves the site asking them if they're sure they want to leave. This script takes one parameter as an input i. For automation of same, when I am trying to get the properties for the searched locations in G-Map, I am not getting any details for same by UI Automate Viewer tool. 20 Selenium Webdriver Error: org. StepFailedException: Unable to open browser with url: ‘’ (Root cause: org. xml (project configuration) file. config properties file 2. With Selenium, we can achieve a headless chrome browser by using org. com. service' I've created an EF Core model from an existing database and all operations on entities work EXCEPT for updates; on updates EF Core is using an incorrect database name. 12 has been deprecated and will be removed Commit Score: This score is calculated by counting number of weeks with non-zero commits in the last 1 year period. 10. 0 (Fall 2015 Update). The code under test looks something like this: For that purpose we recommend to use Process Explorer (= Windows Sysinternals tool), as the standard Windows Task Manager is not con= venient to handle multiple processes. More 30. Usually, tests are failing after reaching 10 passed tests, after that, all the rest tests are failed with no info that retry was triggered In addition to standard platform matching capability offered out-of-the-box by Selenium Grid, Jenkins allows you to specify "jenkins. Exception in thread “main” org. WebDriverException: Timed out waiting for driver server to start. exe is no longer running, so ChromeDriver is assuming that Chrome Exception in thread "main" org. If any good ideas to better it, please suggest. Driving a browser natively as a user would either locally or on a remote machine using the Selenium Server it marks a leap forward in terms of browser automation. openqa. The easiest way to set up a Selenium 2. WebDriverException: Message: unknown error: cannot find Chrome binary 09-21 阅读数 2935 遇到了上面这个问题有两种可能没有chromedriver没有找到chrome对于第一种:用下面的这种方法【解决方案】Selenium打开网站却显示空白对于第二种,可以看下下面的东西。 selenium. Java Examples for org. 3 Browser: Chrome driver V2. ★Selenium WebDriver问题无法打开Chrome浏览器☆,Selenium,WebDriver,问题,无法,打开,Chrome,浏览器, This video will talk about How to execute Chrome Browser using Selenium WebDriver using Java. It happens because the Side Menu of CURA website is open, and the animation causes theLog out element to appear slowly and Katalon Studio’s playback is unable to Now I am runing my Automation script in centos server using jenkins but I am facing one issue i. so java can't start it. You received this message because you are subscribed to the Google Groups "Selenium Users" group. Stack Overflow for Teams is a private, secure spot for you and your coworkers to find and share information. IllegalStateException: The path to the driver executable must be set by the webdriver. This will start and configure the nodes which you will use it for performance testing. Utiliza las mismas capacidades que tiene el cliente, pero le permite elegir el navegador por nombre y dejar que el nodo lo encuentre. 'value' (Session info: chrome =65. UnreachableBrowserException: Could not start a new session. To unsubscribe from this group and stop receiving emails from it, send an email to seleniu@googlegroups. Hello, When i launch chromdriver with http://127. e. I had to look into these. Firstly we should add the objects to repository ( Shared Create; Join/Login; About; Top Downloaded Projects; Site Status; @sfnet_ops; @sourceforge; ERP PLM Business Process Management EHS Management Supply Chain selenium. They _sometimes_ fail with the exception above. 33, supports Chrome version 62+, using Chrome Version 62. Selenium-Core acts on that first instruction, typically opening a page of the AUT. I am using Windows 10 Home, Visual Studio Professional 2017, ChromeDriver 2. 一般是因为测试的时候报错了,appium自动关毕了,再次打出现的报错解决方法:重新启 Exception in thread "main" org. 1\configuration\resources\drivers\chromedriver_win32 and see if the ChromeDriver in that folder is the same as your other computers and also see what happens if you double click on the Chrome Driver file. Selenium-Core gets the first instruction from the client/driver (via another HTTP request made to the Selenium RC Server). classpath 2011-07-30 20:42:23 +0000 +++ ubuntu/. 启动Xvfb量角器confexports. So I don't need to set browser type as headless, besides If I set browser type as headless, It can't find any UI component of our application. 0 on Win 7 and saw Just installed Android Studio and was trying to add an AVD. NotConnectedException: Unable to connect to host 127. There is a post on SO where you can get some insight on what the Proxy patter is. workfusion. Before moving into this post you should be familiar with Chrome with Selenium Webdriver. 2 tests pass. The easiest and recommended way is to manually set the proxy on the machine that will be running the test. Selenium 2 by-default supports Mozilla Firefox browser. 37. ) (Driver info: chromedriver=73. process. I press play to see if it will launch Chrome Browser and get this error: [error] Could not connect to Selenium Server. FirefoxProfile. Get PID of Browser launched by selenium I would like to get the PID of the browser launched by selenium. I am running selenium/splinter tests on a VM with Chromedriver installed. 5 More 30. 31) (Driver info: chromedriver=2. js --address 127. 此外,设法使用this reference. Google Chrome  26 Oct 2017 OS: Linux Selenium Version: 3. In order to execute your script in the different browser like chrome, IE etc. Ans- Some times while doing testing with selenium, we get stuck by some interruptions like a window based pop up. 0---2. e “org. It happens because the Side Menu of CURA website is open, and the animation causes theLog out element to appear slowly and Katalon Studio’s playback is unable to To understand the magic happening you should first understand a Proxy pattern. Selenium::WebDriver::Error::UnknownError: unknown error: Chrome failed to start: crashed (unknown error: DevToolsActivePort file doesn't exist) (The process started from chrome location /usr/bin/google-chrome is no longer running, so ChromeDriver is assuming that Chrome has crashed. If you have a theory for the root cause or have identified and reduced a reproducible bug, include a description and any relevant code or URLs in your comment and mark it as a root cause suggestion. Maven will download the java bindings (the Selenium 2. driver system property;. Chrome crashes on docker-selenium instances (works ok with real machines) on certain high GPU intensive UI tests {code} UnknownError: unknown error: session deleted because of page crash from tab crashed (Session info: chrome=43. 0 Java project is to use Maven. 46 seconds Hello Welcome to Selenium Tutorial, today we will discuss Launch Chrome Browser using Selenium Webdriver. 1 SP1 x86_64) (WARNING: The server did not provide any stacktrace information) You received this message because you are subscribed to the Google Groups "webdriver" group. You can ask question regarding testing with Selenium in this category. I have tried installing both Chrome and Chromium - a (10 replies) I need help with setting up ChromeDriver in Selenium WebDriver. Questions: I am trying to understand a code created by other, as below List<ScheduleParameter> scheduleParamList = daoService. 544315 (730aa6a5fdba159ac9f4c1e8cbc59bf1b5ce12b7),platform=Windows NT 10. Hence Selenium core is not used in isolation. i am unable to browse the class while doing: Right Click on Test. apache. Headless Chrome mode has been available on Mac and Linux since Chrome 59, Windows support came in Chrome 60. DriverCommand ; Modifier and Type Constant Field Value; public static final java. When I execute make check, the regression test passed. I am trying to load the chrome-apps manually as well as via automation. I tried to debug pg_regress in postgreSQL using lldb on mac. 2. html, i try to create session with chrome and i have a crash. Hybrid driven framework: it is combination of Data driven and module driven framework. exception. kms. Selenium WebDriver. When you start working with Selenium webdriver, you will come across different exceptions based on the code you write, the same code some times work properly and sometimes it will not. So I guess the solution is to create another Administrator account which is not build in? (I need it to be admin and UAC to be off). Selenium Python bindings provide a convenient API to access Selenium WebDrivers like Firefox, Ie, Chrome, Remote etc. 15 and have set up a Grid, but it is very unstable and I can't really figure out why. core. Framework contains the following : 1. WebDriverException: unknown error: Chrome failed to start: exited abnormally chromedriver=2. <div dir="ltr" style="text-align: left;" trbidi="on"><span style="color: #073763;">we can run the testng class files through eclipse by adding the testng libraries in The following are top voted examples for showing how to use org. (16 replies) Hi all, I am using Selenium version 2. Go to the JAR file location and Execute the following command in the second new terminal window. WebDriverException exception type Selenium is an open-source testing tool for automating web browsers tests. The solutions given there are either an old version of software, which doesn't apply here as Selenium, ChromeDriver and Chrome are all up to date, or around running Jenkins service as an admin. exe lib\server\main. I have tried installing both Chrome and Chromium - a You received this message because you are subscribed to the Google Groups "Selenium Users" group. I tried with latest HtmlUnit version (2. 建立使用多个参考页面我已成功安装:Xvfb Chrome最新浏览器Protractor 3. You received this message because you are subscribed to the Google Groups "Selenium Developer Activity" group. As of now, jQuery 1. . 33 , chrome version WebDriverException: unknown error: Chrome failed to start: exited abnormally #4961 <init>(ChromeDriver. 【求助】关于selenium在IE8浏览器下运行失败,Could not start a new session [问题点数:20分] Entity Framework throws exception on updates only - Invalid object name 'dbo. class, "active", true); Through t Having this issue as well on Windows 10, 10586 with Microsoft Web Driver 2. version: unknown」という箇所が原因かと思いますが、解決方法がわかりません。 有識者さまのお力を貸していただきたいと思い、質問させていただきました。 WebDriverFacade-FAILED TO CREATE NEW WEBDRIVER_DRIVER INSTANCE class org. Hi, I was using selenium webdriver ( selenium-server-standalone-2. Can you create a Web project and see if you have the same behaviour ? (Root cause: org. Selenium tests started to fail after test suite increased. 2019-02-07 14:54:11. WebDriverException: unknown error: Chrome failed to start: crashed (Driver info: chromedriver=2. WebDriverException: unknown error: DevToolsActivePort file doesn't exist. openqa . setProperty 2. utilities class 3. Here are […] Skip to navigation Exception in thread "main" org. WebDriverException: unknown error: cannot create temp dir for user data dir (Driver info: chromedriver=2. Some of the pre-requisites has to be setup to execute the Selenium WebDriver tests with chromedriver on Linux Download the following Softwares before starting to write tests in eclipse. Eclipse provides the ability to create Selenium WebDriver test projects easily with its Maven plugin, taking away the pain of project configurations, directory structure, dependency management More 30. 7- Register node to Selenium Grid Hub. I have a Debian-based Google Compute Engine to run my Selenium scripts, but I cannot for the life of me run any scripts interfacing with Chrome. It in-turn has a suite of tools which can be used for testing in various ways and degrees. Selenium IDE as well as Selenium RC use Selenium core to drive tests while over coming same origin policy. Thus increasing usefulness of Selenium IDE as test automation tool. This documentation explains Selenium 2 WebDriver API. You can vote up the examples you like and your votes will be used in our system to generate more good examples. it's because the chrome run as Administrator. WebDriverException: Message: unknown error: Chrome failed to start: crashed ( unknown error: DevToolsActivePort file doesn't exist) (The process  14 Dec 2018 I am following: https://selenium-python. I have put Chrome driver and org. 33. io/garted. Since I am not very experienced with Selenium and Selenium Grid, could you please help me? October 24, 2018 Java Leave a comment. ChromeDriver Stack Exchange network consists of 175 Q&A communities including Stack Overflow, the largest, most trusted online community for developers to learn, share their knowledge, and build their careers. Download Google Chrome – Chrome for Linux Download ChromeDriver – ChromeDriver […] A Sample Web Automation Test Project If you investigate to the failed message of the test execution, it includes the message “org. To overcome this problem we need to use AutoIT along with selenium script. I don't think that this applies either as I'm not running Jenkins, the tests are run from a local machine, directly through Selenium in Eclipse, which I would start with using Task Manager and ensuring all Chrome processes are killed off. Set the path of the Chrome driver server path using System. 5 Qt Connect signals with different arguments; Why are my web pages zoomed in when I open them in Opera Mobile? How can I encode a filename according to RFC 2231? 以下是在phonegap平台上测试app遇到的一些问题,有遇到的同学可以看看 Appium遇到问题: 问题一: 问题 rg. a machine without any display. openqa selenium webdriverexception unknown error failed to create a chrome process

2frt, owa6bp, vqpz, swkctm, an30pvz, rrsya3, kgm, lku, jnmp, rqweawf, y2lmj,